Reaction Details
Target5-hydroxytryptamine receptor 3A/3B
LigandBDBM50042718
Substrate/Competitorn/a
Meas. Tech.ChEMBL_3003 (CHEMBL619793)
Ki 0.190000±n/a nM
Citation van Wijngaarden, IHamminga, Dvan Hes, RStandaar, PJTipker, JTulp, MTMol, FOlivier, Bde Jonge, A Development of high-affinity 5-HT3 receptor antagonists. Structure-affinity relationships of novel 1,7-annelated indole derivatives. J Med Chem36:3693-9 (1994) 5-hydroxytryptamine receptor 3A/3B
Name:5-hydroxytryptamine receptor 3A/3B
Type:n/a
Mol. Mass.:n/a
Description:ASSAY_ID of EBI is 2974
Components:This complex has 2 components.
Component 1
Name:5-hydroxytryptamine receptor 3B
Synonyms:5HT3B_RAT Serotonin (5-HT) receptor
Type:PROTEIN
Mol. Mass.:50328.78
Organism:Rattus norvegicus
Description:EBI_11885
Residue:437
Component 2
Name:5-hydroxytryptamine receptor 3A
Synonyms:5-HT3 5HT3A_RAT Htr3 Serotonin (5-HT) receptor | Zacopride site-R
Type:Enzyme Catalytic Domain
Mol. Mass.:55428.70
Organism:RAT
Description:5-HT3 HTR3A RAT::P35563
Residue:483
BDBM50042718
NameBDBM50042718
Synonyms:1-(3,4-Dihydro-5-thia-2a-aza-acenaphthylen-1-yl)-3-(5-methyl-1H-imidazol-4-yl)-propan-1-one | CHEMBL122904
TypeSmall organic molecule
Emp. Form.C17H17N3OS
Mol. Mass.311.401
SMILESCc1nc[nH]c1CCC(=O)c1cn2CCSc3cccc1c23