Reaction Details
TargetAngiotensin-converting enzyme
LigandBDBM50021127
Substrate/Competitorn/a
Meas. Tech.ChEMBL_34915 (CHEMBL648451)
IC50 2±n/a nM
Citation Stanton, JLSperbeck, DMTrapani, AJCote, DSakane, YBerry, CJGhai, RD Heterocyclic lactam derivatives as dual angiotensin converting enzyme and neutral endopeptidase 24.11 inhibitors. J Med Chem36:3829-33 (1994) Angiotensin-converting enzyme
Name:Angiotensin-converting enzyme
Type:n/a
Mol. Mass.:150405.15
Organism:Oryctolagus cuniculus
Description:n/a
Residue:1310
BDBM50021127
NameBDBM50021127
Synonyms:2-(1-Carboxymethyl-2-oxo-2,3,4,5-tetrahydro-1H-benzo[b]azepin-3-ylamino)-4-phenyl-butyric acid; hydrochloride | CHEMBL543766
TypeSmall organic molecule
Emp. Form.C22H24N2O5
Mol. Mass.396.4364
SMILESOC(=O)CN1c2ccccc2CC[C@H](N[C@@H](CCc2ccccc2)C(O)=O)C1=O