Reaction Details
Target5-lipoxygenase
LigandBDBM50043351
Substrate/Competitorn/a
Meas. Tech.ChEMBL_3983 (CHEMBL619256)
IC50 33000±n/a nM
Citation Müller, KGürster, DPiwek, SWiegrebe, W Antipsoriatic anthrones with modulated redox properties. 1. Novel 10-substituted 1,8-dihydroxy-9(10H)-anthracenones as inhibitors of 5-lipoxygenase. J Med Chem36:4099-107 (1994) 5-lipoxygenase
Name:5-lipoxygenase
Synonyms:Arachidonate 5-lipoxygenase
Type:PROTEIN
Mol. Mass.:49994.23
Organism:Bos taurus
Description:ChEMBL_157766
Residue:430
BDBM50043351
NameBDBM50043351
TypeSmall organic molecule
Emp. Form.C18H16O4
Mol. Mass.296.3172
SMILESCCCC(=O)C1c2cccc(O)c2C(=O)c2c(O)cccc12