Reaction Details
Target5-lipoxygenase
LigandBDBM50043352
Substrate/Competitorn/a
Meas. Tech.ChEMBL_51443 (CHEMBL664363)
IC50 2000±n/a nM
Citation Müller, KGürster, DPiwek, SWiegrebe, W Antipsoriatic anthrones with modulated redox properties. 1. Novel 10-substituted 1,8-dihydroxy-9(10H)-anthracenones as inhibitors of 5-lipoxygenase. J Med Chem36:4099-107 (1994) 5-lipoxygenase
Name:5-lipoxygenase
Synonyms:Arachidonate 5-lipoxygenase
Type:PROTEIN
Mol. Mass.:49994.23
Organism:Bos taurus
Description:ChEMBL_157766
Residue:430
BDBM50043352
NameBDBM50043352
TypeSmall organic molecule
Emp. Form.C21H14O5
Mol. Mass.346.3329
SMILES[#8]-c1ccc(\[#6]=[#6]-2\c3cccc(-[#8])c3-[#6](=O)-c3c(-[#8])cccc-23)cc1-[#8]