Reaction Details
Target5-lipoxygenase
LigandBDBM50043348
Substrate/Competitorn/a
Meas. Tech.ChEMBL_3983 (CHEMBL619256)
IC50 2000±n/a nM
Citation Müller, KGürster, DPiwek, SWiegrebe, W Antipsoriatic anthrones with modulated redox properties. 1. Novel 10-substituted 1,8-dihydroxy-9(10H)-anthracenones as inhibitors of 5-lipoxygenase. J Med Chem36:4099-107 (1994) 5-lipoxygenase
Name:5-lipoxygenase
Synonyms:Arachidonate 5-lipoxygenase
Type:PROTEIN
Mol. Mass.:49994.23
Organism:Bos taurus
Description:ChEMBL_157766
Residue:430
BDBM50043348
NameBDBM50043348
TypeSmall organic molecule
Emp. Form.C21H13NO5
Mol. Mass.359.3316
SMILES[#8]-c1cccc2\[#6](=[#6]\c3ccc(cc3)-[#7+](-[#8-])=O)-c3cccc(-[#8])c3-[#6](=O)-c12