Reaction Details
Target5-lipoxygenase
LigandBDBM50043347
Substrate/Competitorn/a
Meas. Tech.ChEMBL_3983 (CHEMBL619256)
IC50 6000±n/a nM
Citation Müller, KGürster, DPiwek, SWiegrebe, W Antipsoriatic anthrones with modulated redox properties. 1. Novel 10-substituted 1,8-dihydroxy-9(10H)-anthracenones as inhibitors of 5-lipoxygenase. J Med Chem36:4099-107 (1994) 5-lipoxygenase
Name:5-lipoxygenase
Synonyms:Arachidonate 5-lipoxygenase
Type:PROTEIN
Mol. Mass.:49994.23
Organism:Bos taurus
Description:ChEMBL_157766
Residue:430
BDBM50043347
NameBDBM50043347
TypeSmall organic molecule
Emp. Form.C23H18O3
Mol. Mass.342.3872
SMILES[#8]-c1cccc2\[#6](=[#6]/[#6]-[#6]-c3ccccc3)-c3cccc(-[#8])c3-[#6](=O)-c12