Reaction Details
TargetCarbonic anhydrase 2
LigandBDBM26985
Substrate/Competitorn/a
Meas. Tech.ChEMBL_1288553 (CHEMBL3118986)
Ki 1510000±n/a nM
Citation Nishimori, IVullo, DMinakuchi, TScozzafava, AOsman, SMAlOthman, ZCapasso, CSupuran, CT Anion inhibition studies of two new ?-carbonic anhydrases from the bacterial pathogen Legionella pneumophila. Bioorg Med Chem Lett24:1127-32 (2014) 
 
Carbonic anhydrase 2
Name:Carbonic anhydrase 2
Type:Enzyme
Mol. Mass.:29250.71
Organism:Homo sapiens (Human)
Description:P00918
Residue:260
BDBM26985
NameBDBM26985
Synonyms:2-triaza-1,2-diyne CHEMBL89295 azide
TypeIon
Emp. Form.N3
Mol. Mass.42.0206
SMILES[N-]=[N+]=[N-]