Reaction Details
Target3-oxo-5-alpha-steroid 4-dehydrogenase 2
LigandBDBM50039257
Substrate/Competitorn/a
Meas. Tech.ChEMBL_88442 (CHEMBL873205)
IC50 0.08±n/a nM
Citation Frye, SVHaffner, CDMaloney, PRMook, RADorsey, GFHiner, RNBatchelor, KWBramson, HNStuart, JDSchweiker, SL 6-Azasteroids: potent dual inhibitors of human type 1 and 2 steroid 5 alpha-reductase. J Med Chem36:4313-5 (1994) 3-oxo-5-alpha-steroid 4-dehydrogenase 2
Name:3-oxo-5-alpha-steroid 4-dehydrogenase 2
Type:Enzyme
Mol. Mass.:28406.59
Organism:Homo sapiens (Human)
Description:P31213
Residue:254
BDBM50039257
NameBDBM50039257
Synonyms:(1S,9aR,11aS)-9a,11a-Dimethyl-1-(3-methyl-butyryl)-1,2,3,3a,3b,4,5,8,9,9a,9b,10,11,11a-tetradecahydro-cyclopenta[i]phenanthridin-7-one CHEMBL420020
TypeSmall organic molecule
Emp. Form.C23H35NO2
Mol. Mass.357.5295
SMILESCC(C)CC(=O)[C@H]1CCC2C3CN=C4CC(=O)CC[C@]4(C)C3CC[C@]12C