Reaction Details
TargetPolyunsaturated fatty acid 5-lipoxygenase
LigandBDBM50043682
Substrate/Competitorn/a
Meas. Tech.ChEMBL_3866 (CHEMBL619382)
IC50 1.3±n/a nM
Citation Lambert-van der Brempt, CBruneau, PLamorlette, MAFoster, SJ Conformational analysis of 5-lipoxygenase inhibitors: role of the substituents in chiral recognition and on the active conformations of the (methoxyalkyl)thiazole and methoxytetrahydropyran series. J Med Chem37:113-24 (1994) Polyunsaturated fatty acid 5-lipoxygenase
Name:Polyunsaturated fatty acid 5-lipoxygenase
Type:PROTEIN
Mol. Mass.:77961.27
Organism:Mus musculus
Description:ChEMBL_675639
Residue:674
BDBM50043682
NameBDBM50043682
Synonyms:(R)-2-[3-Fluoro-5-(naphthalen-2-ylmethoxy)-phenyl]-2-methoxy-butyric acid methyl ester | CHEMBL21880
TypeSmall organic molecule
Emp. Form.C23H23FO4
Mol. Mass.382.4247
SMILESCC[C@](OC)(C(=O)OC)c1cc(F)cc(OCc2ccc3ccccc3c2)c1