Reaction Details
TargetCarbonic anhydrase 2
LigandBDBM50496143
Substrate/Competitorn/a
Meas. Tech.ChEMBL_1292870 (CHEMBL3122609)
Ki 6.6±n/a nM
Citation SitaRam, naCelik, GKhloya, PVullo, DSupuran, CTSharma, PK Benzenesulfonamide bearing 1,2,4-triazole scaffolds as potent inhibitors of tumor associated carbonic anhydrase isoforms hCA IX and hCA XII. Bioorg Med Chem22:1873-82 (2014) 
 
Carbonic anhydrase 2
Name:Carbonic anhydrase 2
Type:Enzyme
Mol. Mass.:29250.71
Organism:Homo sapiens (Human)
Description:P00918
Residue:260
BDBM50496143
NameBDBM50496143
Synonyms:CHEMBL3121770
TypeSmall organic molecule
Emp. Form.C14H11FN4O2S2
Mol. Mass.350.391
SMILESNS(=O)(=O)c1ccc(cc1)-n1c(n[nH]c1=S)-c1ccc(F)cc1