Reaction Details
TargetCarbonic anhydrase 9
LigandBDBM50496143
Substrate/Competitorn/a
Meas. Tech.ChEMBL_1292869 (CHEMBL3122608)
Ki 2.8±n/a nM
Citation SitaRam, naCelik, GKhloya, PVullo, DSupuran, CTSharma, PK Benzenesulfonamide bearing 1,2,4-triazole scaffolds as potent inhibitors of tumor associated carbonic anhydrase isoforms hCA IX and hCA XII. Bioorg Med Chem22:1873-82 (2014) 
 
Carbonic anhydrase 9
Name:Carbonic anhydrase 9
Type:Enzyme
Mol. Mass.:49669.03
Organism:Homo sapiens (Human)
Description:Catalytic domain of human cloned isozyme was used in the assay
Residue:459
BDBM50496143
NameBDBM50496143
Synonyms:CHEMBL3121770
TypeSmall organic molecule
Emp. Form.C14H11FN4O2S2
Mol. Mass.350.391
SMILESNS(=O)(=O)c1ccc(cc1)-n1c(n[nH]c1=S)-c1ccc(F)cc1