Reaction Details
TargetGlutathione S-transferase P
LigandBDBM50043758
Substrate/Competitorn/a
Meas. Tech.ChEMBL_72451 (CHEMBL686006)
Ki 10000±n/a nM
Citation Lyttle, MHHocker, MDHui, HCCaldwell, CGAaron, DTEngqvist-Goldstein, AFlatgaard, JEBauer, KE Isozyme-specific glutathione-S-transferase inhibitors: design and synthesis. J Med Chem37:189-94 (1994) Glutathione S-transferase P
Name:Glutathione S-transferase P
Type:Enzyme
Mol. Mass.:23353.53
Organism:Homo sapiens (Human)
Description:P09211
Residue:210
BDBM50043758
NameBDBM50043758
Synonyms:2-Amino-4-[1-(carboxymethyl-carbamoyl)-2-hexylsulfanyl-ethylcarbamoyl]-butyric acid | CHEMBL58135
TypeSmall organic molecule
Emp. Form.C16H29N3O6S
Mol. Mass.391.483
SMILESCCCCCCSCC(NC(=O)CCC(N)C(O)=O)C(=O)NCC(O)=O