Reaction Details
TargetGlutathione S-transferase A1
LigandBDBM50043759
Substrate/Competitorn/a
Meas. Tech.ChEMBL_72446 (CHEMBL682616)
Ki 360000±n/a nM
Citation Lyttle, MHHocker, MDHui, HCCaldwell, CGAaron, DTEngqvist-Goldstein, AFlatgaard, JEBauer, KE Isozyme-specific glutathione-S-transferase inhibitors: design and synthesis. J Med Chem37:189-94 (1994) Glutathione S-transferase A1
Name:Glutathione S-transferase A1
Type:Enzyme
Mol. Mass.:25636.31
Organism:Homo sapiens (Human)
Description:Glutathione-S-Transferase (GST, N-terminally)
Residue:222
BDBM50043759
NameBDBM50043759
Synonyms:2-Amino-4-[2-benzylsulfanyl-1-(2-carboxy-ethylcarbamoyl)-ethylcarbamoyl]-butyric acid | CHEMBL58451
TypeSmall organic molecule
Emp. Form.C18H25N3O6S
Mol. Mass.411.473
SMILESNC(CCC(=O)NC(CSCc1ccccc1)C(=O)NCCC(O)=O)C(O)=O