Reaction Details
TargetGlutathione S-transferase Mu 2
LigandBDBM50043760
Substrate/Competitorn/a
Meas. Tech.ChEMBL_72449 (CHEMBL682619)
Ki 48300±n/a nM
Citation Lyttle, MHHocker, MDHui, HCCaldwell, CGAaron, DTEngqvist-Goldstein, AFlatgaard, JEBauer, KE Isozyme-specific glutathione-S-transferase inhibitors: design and synthesis. J Med Chem37:189-94 (1994) Glutathione S-transferase Mu 2
Name:Glutathione S-transferase Mu 2
Type:PROTEIN
Mol. Mass.:25743.85
Organism:Homo sapiens (Human)
Description:ChEMBL_1441153
Residue:218
BDBM50043760
NameBDBM50043760
Synonyms:2-Amino-4-[1-[(carboxy-phenyl-methyl)-carbamoyl]-2-(4-chloro-benzylsulfanyl)-ethylcarbamoyl]-butyric acid | CHEMBL442360
TypeSmall organic molecule
Emp. Form.C23H26ClN3O6S
Mol. Mass.507.987
SMILESNC(CCC(=O)NC(CSCc1ccc(Cl)cc1)C(=O)NC(C(O)=O)c1ccccc1)C(O)=O