Reaction Details
TargetThromboxane-A synthase
LigandBDBM50043826
Substrate/Competitorn/a
Meas. Tech.ChEMBL_209417 (CHEMBL816624)
IC50 2±n/a nM
Citation Soyka, RHeckel, ANickl, JEisert, WMüller, THWeisenberger, H 6,6-Disubstituted Hex-5-enoic acid derivatives as combined thromboxane A2 receptor antagonists and synthetase inhibitors. J Med Chem37:26-39 (1994) Thromboxane-A synthase
Name:Thromboxane-A synthase
Type:Enzyme
Mol. Mass.:60524.67
Organism:Homo sapiens (Human)
Description:P24557
Residue:533
BDBM50043826
NameBDBM50043826
Synonyms:6-{4-[2-(4-Chloro-benzenesulfonylamino)-ethyl]-phenyl}-6-pyridin-3-yl-hexanoic acid | CHEMBL339269
TypeSmall organic molecule
Emp. Form.C25H27ClN2O4S
Mol. Mass.487.011
SMILESOC(=O)CCCCC(c1ccc(CCNS(=O)(=O)c2ccc(Cl)cc2)cc1)c1cccnc1