Reaction Details
TargetD(2) dopamine receptor
LigandBDBM50001859
Substrate/Competitorn/a
Meas. Tech.ChEMBL_61434 (CHEMBL671407)
IC50 222±n/a nM
Citation Perrone, RBerardi, FColabufo, NATortorella, VFiorentini, FOlgiati, VVanotti, EGovoni, S Mixed 5-HT1A/D-2 activity of a new model of arylpiperazines: 1-aryl-4-[3-(1,2-dihydronaphthalen-4-yl)-n-propyl]piperazines. 1. Synthesis and structure-activity relationships. J Med Chem37:99-104 (1994) D(2) dopamine receptor
Name:D(2) dopamine receptor
Type:G Protein-Coupled Receptor (GPCR)
Mol. Mass.:50931.60
Organism:Rattus norvegicus (rat)
Description:P61169
Residue:444
BDBM50001859
NameBDBM50001859
Synonyms:(buspirone) 8-[4-(4-Pyrimidin-2-yl-piperazin-1-yl)-butyl]-8-aza-spiro[4.5]decane-7,9-dione 8-[4-(4-Pyrimidin-2-yl-piperazin-1-yl)-butyl]-8-aza-spiro[4.5]decane-7,9-dione; Hydrochloride(Buspirone) BUSPAR CHEMBL49 | US10562853, Compound Buspirone
TypeSmall organic molecule
Emp. Form.C21H31N5O2
Mol. Mass.385.5031
SMILESO=C1CC2(CCCC2)CC(=O)N1CCCCN1CCN(CC1)c1ncccn1