Reaction Details
TargetCarbonic anhydrase 1
LigandBDBM50143903
Substrate/Competitorn/a
Meas. Tech.ChEMBL_1295728 (CHEMBL3129540)
Ki>50000±n/a nM
Citation D'Ascenzio, MCarradori, SDe Monte, CSecci, DCeruso, MSupuran, CT Design, synthesis and evaluation of N-substituted saccharin derivatives as selective inhibitors of tumor-associated carbonic anhydrase XII. Bioorg Med Chem22:1821-31 (2014) 
 
Carbonic anhydrase 1
Name:Carbonic anhydrase 1
Type:Enzyme
Mol. Mass.:28873.37
Organism:Homo sapiens (Human)
Description:P00915
Residue:261
BDBM50143903
NameBDBM50143903
Synonyms:CHEMBL3125555
TypeSmall organic molecule
Emp. Form.C9H7NO5S
Mol. Mass.241.221
SMILESOC(=O)CN1C(=O)c2ccccc2S1(=O)=O