Reaction Details
TargetCarbonic anhydrase 2
LigandBDBM50496541
Substrate/Competitorn/a
Meas. Tech.ChEMBL_1297772 (CHEMBL3131404)
Ki 4.0±n/a nM
Citation Khloya, PCelik, GSitaRam, naVullo, DSupuran, CTSharma, PK 4-Functionalized 1,3-diarylpyrazoles bearing benzenesulfonamide moiety as selective potent inhibitors of the tumor associated carbonic anhydrase isoforms IX and XII. Eur J Med Chem76:284-90 (2014) 
 
Carbonic anhydrase 2
Name:Carbonic anhydrase 2
Type:Enzyme
Mol. Mass.:29250.71
Organism:Homo sapiens (Human)
Description:P00918
Residue:260
BDBM50496541
NameBDBM50496541
Synonyms:CHEMBL3126811
TypeSmall organic molecule
Emp. Form.C16H13FN4O3S
Mol. Mass.360.363
SMILESNC(=O)c1cn(nc1-c1ccc(F)cc1)-c1ccc(cc1)S(N)(=O)=O