Reaction Details
TargetCarbonic anhydrase 12
LigandBDBM50496547
Substrate/Competitorn/a
Meas. Tech.ChEMBL_1297770 (CHEMBL3131402)
Ki 5.0±n/a nM
Citation Khloya, PCelik, GSitaRam, naVullo, DSupuran, CTSharma, PK 4-Functionalized 1,3-diarylpyrazoles bearing benzenesulfonamide moiety as selective potent inhibitors of the tumor associated carbonic anhydrase isoforms IX and XII. Eur J Med Chem76:284-90 (2014) 
 
Carbonic anhydrase 12
Name:Carbonic anhydrase 12
Type:Enzyme
Mol. Mass.:39456.00
Organism:Homo sapiens (Human)
Description:Catalytic domain of human cloned isozyme was used in the assay
Residue:354
BDBM50496547
NameBDBM50496547
Synonyms:CHEMBL3126824
TypeSmall organic molecule
Emp. Form.C16H13BrN4O3S
Mol. Mass.421.268
SMILESNC(=O)c1cn(nc1-c1ccc(Br)cc1)-c1ccc(cc1)S(N)(=O)=O