Reaction Details
TargetCarbonic anhydrase 9
LigandBDBM50496537
Substrate/Competitorn/a
Meas. Tech.ChEMBL_1297771 (CHEMBL3131403)
Ki 6.9±n/a nM
Citation Khloya, PCelik, GSitaRam, naVullo, DSupuran, CTSharma, PK 4-Functionalized 1,3-diarylpyrazoles bearing benzenesulfonamide moiety as selective potent inhibitors of the tumor associated carbonic anhydrase isoforms IX and XII. Eur J Med Chem76:284-90 (2014) 
 
Carbonic anhydrase 9
Name:Carbonic anhydrase 9
Type:Enzyme
Mol. Mass.:49669.03
Organism:Homo sapiens (Human)
Description:Catalytic domain of human cloned isozyme was used in the assay
Residue:459
BDBM50496537
NameBDBM50496537
Synonyms:CHEMBL3126805
TypeSmall organic molecule
Emp. Form.C17H17N5O4S
Mol. Mass.387.413
SMILESCOc1ccc(cc1)-c1nn(cc1C(=O)NN)-c1ccc(cc1)S(N)(=O)=O