Reaction Details
TargetCarbonic anhydrase 9
LigandBDBM50496530
Substrate/Competitorn/a
Meas. Tech.ChEMBL_1297771 (CHEMBL3131403)
Ki 5.8±n/a nM
Citation Khloya, PCelik, GSitaRam, naVullo, DSupuran, CTSharma, PK 4-Functionalized 1,3-diarylpyrazoles bearing benzenesulfonamide moiety as selective potent inhibitors of the tumor associated carbonic anhydrase isoforms IX and XII. Eur J Med Chem76:284-90 (2014) 
 
Carbonic anhydrase 9
Name:Carbonic anhydrase 9
Type:Enzyme
Mol. Mass.:49669.03
Organism:Homo sapiens (Human)
Description:Catalytic domain of human cloned isozyme was used in the assay
Residue:459
BDBM50496530
NameBDBM50496530
Synonyms:CHEMBL3126823
TypeSmall organic molecule
Emp. Form.C17H16N4O4S
Mol. Mass.372.398
SMILESCOc1ccc(cc1)-c1nn(cc1C(N)=O)-c1ccc(cc1)S(N)(=O)=O