Reaction Details
Target5-hydroxytryptamine receptor 1A
LigandBDBM50035330
Substrate/Competitorn/a
Meas. Tech.ChEBML_1203
Ki 7±n/a nM
Citation Stjernlöf, PGullme, MElebring, TAndersson, BWikström, HLagerquist, SSvensson, KEkman, ACarlsson, ASundell, S (S)- and (R)-8-(di-n-propylamino)-6,7,8,9-tetrahydro-3H-benz[e]indole-1- carbaldehyde: a new class of orally active 5-HT1A-receptor agonists. J Med Chem36:2059-65 (1993) 5-hydroxytryptamine receptor 1A
Name:5-hydroxytryptamine receptor 1A
Type:G Protein-Coupled Receptor (GPCR)
Mol. Mass.:46445.29
Organism:Rattus norvegicus (rat)
Description:Binding assays were performed using rat hippocampal membranes.
Residue:422
BDBM50035330
NameBDBM50035330
Synonyms:CHEMBL302172 R-(+)-Dipropyl-(6,7,8,9-tetrahydro-3H-benzo[e]indol-8-yl)-amine
TypeSmall organic molecule
Emp. Form.C18H26N2
Mol. Mass.270.4124
SMILESCCCN(CCC)[C@@H]1CCc2ccc3[nH]ccc3c2C1