Reaction Details
TargetLanosterol 14-alpha demethylase
LigandBDBM50044425
Substrate/Competitorn/a
Meas. Tech.ChEMBL_218503 (CHEMBL824126)
Ki 37±n/a nM
Citation Walker, KAKertesz, DJRotstein, DMSwinney, DCBerry, PWSo, OYWebb, ASWatson, DMMak, AYBurton, PM Selective inhibition of mammalian lanosterol 14 alpha-demethylase: a possible strategy for cholesterol lowering. J Med Chem36:2235-7 (1993) Lanosterol 14-alpha demethylase
Name:Lanosterol 14-alpha demethylase
Type:PROTEIN
Mol. Mass.:56717.47
Organism:Rattus norvegicus
Description:ChEMBL_52075
Residue:503
BDBM50044425
NameBDBM50044425
Synonyms:4-{(2R,4R)-2-[2-(4-Chloro-phenyl)-ethyl]-2-imidazol-1-ylmethyl-[1,3]dioxolan-4-ylmethylsulfanyl}-phenylamine CHEMBL305220
TypeSmall organic molecule
Emp. Form.C22H24ClN3O2S
Mol. Mass.429.963
SMILESNc1ccc(SC[C@H]2CO[C@@](CCc3ccc(Cl)cc3)(Cn3ccnc3)O2)cc1