Reaction Details
TargetMyosin light chain kinase, smooth muscle
LigandBDBM199250
Substrate/Competitorn/a
Meas. Tech.ChEMBL_1330231 (CHEMBL3224487)
IC50 16±n/a nM
Citation Pireddu, RForinash, KDSun, NNMartin, MPSung, SSAlexander, BZhu, JYGuida, WCSchönbrunn, ESebti, SMLawrence, NJ Pyridylthiazole-based ureas as inhibitors of Rho associated protein kinases (ROCK1 and 2). Medchemcomm3:699-709 (2012) 
 
Myosin light chain kinase, smooth muscle
Name:Myosin light chain kinase, smooth muscle
Type:Protein
Mol. Mass.:210702.56
Organism:Homo sapiens (Human)
Description:Q15746
Residue:1914
BDBM199250
NameBDBM199250
Synonyms:US9221808, 1bo US9221808, 1bo-Mes
TypeSmall organic molecule
Emp. Form.C16H14N4O2S
Mol. Mass.326.373
SMILESOc1cccc(CNC(=O)Nc2nc(cs2)-c2ccncc2)c1