Reaction Details
Target5-hydroxytryptamine receptor 1A
LigandBDBM50044440
Substrate/Competitorn/a
Meas. Tech.ChEBML_1439
Ki 30±n/a nM
Citation Ismaiel, AMDe Los Angeles, JTeitler, MIngher, SGlennon, RA Antagonism of 1-(2,5-dimethoxy-4-methylphenyl)-2-aminopropane stimulus with a newly identified 5-HT2- versus 5-HT1C-selective antagonist. J Med Chem36:2519-25 (1993) 5-hydroxytryptamine receptor 1A
Name:5-hydroxytryptamine receptor 1A
Type:G Protein-Coupled Receptor (GPCR)
Mol. Mass.:46445.29
Organism:Rattus norvegicus (rat)
Description:Binding assays were performed using rat hippocampal membranes.
Residue:422
BDBM50044440
NameBDBM50044440
Synonyms:8-(4-Phenoxy-butyl)-1-phenyl-1,3,8-triaza-spiro[4.5]decan-4-one | CHEMBL82436
TypeSmall organic molecule
Emp. Form.C23H29N3O2
Mol. Mass.379.4953
SMILESO=C1NCN(c2ccccc2)C11CCN(CCCCOc2ccccc2)CC1