Reaction Details
TargetP2Y purinoceptor 4
LigandBDBM50496860
Substrate/Competitorn/a
Meas. Tech.ChEMBL_1330931 (CHEMBL3224911)
EC50 25±n/a nM
Citation Jayasekara, PSBarrett, MOBall, CBBrown, KAKozma, ECostanzi, SSquarcialupi, LBalasubramanian, RMaruoka, HJacobson, KA 4-Alkyloxyimino-cytosine nucleotides: tethering approaches to molecular probes for the P2Y Medchemcomm4:1156-1165 (2013) 
 
P2Y purinoceptor 4
Name:P2Y purinoceptor 4
Type:PROTEIN
Mol. Mass.:40977.17
Organism:Homo sapiens (Human)
Description:ChEMBL_751027
Residue:365
BDBM50496860
NameBDBM50496860
Synonyms:CHEMBL1198849
TypeSmall organic molecule
Emp. Form.C10H18N3O15P3
Mol. Mass.513.1823
SMILESCO\N=c1/ccn([C@@H]2O[C@H](COP(O)(=O)OP(O)(=O)OP(O)(O)=O)[C@@H](O)[C@H]2O)c(=O)[nH]1