Reaction Details
TargetNuclear factor erythroid 2-related factor 2
LigandBDBM50013843
Substrate/Competitorn/a
Meas. Tech.ChEMBL_1335748 (CHEMBL3239747)
Kd 15400±n/a nM
Citation Zhuang, CNarayanapillai, SZhang, WSham, YYXing, C Rapid identification of Keap1-Nrf2 small-molecule inhibitors through structure-based virtual screening and hit-based substructure search. J Med Chem57:1121-6 (2014) 
 
Nuclear factor erythroid 2-related factor 2
Name:Nuclear factor erythroid 2-related factor 2
Type:PROTEIN
Mol. Mass.:67786.89
Organism:Homo sapiens (Human)
Description:ChEMBL_107924
Residue:605
BDBM50013843
NameBDBM50013843
Synonyms:CHEMBL1868007
TypeSmall organic molecule
Emp. Form.C19H17NO5S2
Mol. Mass.403.472
SMILESCc1ccc(cc1)S(=O)(=O)Nc1cc(SCC(O)=O)c(O)c2ccccc12