Reaction Details
TargetLeukotriene B4 receptor 1
LigandBDBM50045092
Substrate/Competitorn/a
Meas. Tech.ChEMBL_99838 (CHEMBL706758)
Ki 5.9±n/a nM
Citation Jackson, WTBoyd, RJFroelich, LLGapinski, DMMallett, BESawyer, JS Design, synthesis, and pharmacological evaluation of potent xanthone dicarboxylic acid leukotriene B4 receptor antagonists. J Med Chem36:1726-34 (1993) Leukotriene B4 receptor 1
Name:Leukotriene B4 receptor 1
Type:Enzyme Catalytic Domain
Mol. Mass.:37582.68
Organism:Homo sapiens (Human)
Description:Q15722
Residue:352
BDBM50045092
NameBDBM50045092
Synonyms:5-(2-Carboxy-ethyl)-6-[(E)-6-(4-methoxy-phenyl)-hex-5-enyloxy]-9-oxo-9H-xanthene-2-carboxylic acid CHEMBL49210 | LY-210073
TypeSmall organic molecule
Emp. Form.C30H28O8
Mol. Mass.516.5385
SMILESCOc1ccc(\C=C\CCCCOc2ccc3c(oc4ccc(cc4c3=O)C(O)=O)c2CCC(O)=O)cc1