Reaction Details
TargetB2 bradykinin receptor
LigandBDBM50045209
Substrate/Competitorn/a
Meas. Tech.ChEBML_40275
Ki 1693±n/a nM
Citation Chakravarty, SWilkins, DKyle, DJ Design of potent, cyclic peptide bradykinin receptor antagonists from conformationally constrained linear peptides. J Med Chem36:2569-71 (1993) B2 bradykinin receptor
Name:B2 bradykinin receptor
Type:n/a
Mol. Mass.:42217.03
Organism:Cavia porcellus
Description:n/a
Residue:372
BDBM50045209
NameBDBM50045209
Synonyms:CHEMBL2370038 | D-Arg-Arg-Pro-Hyp-N-methylGly-N-methylPhe-Ser-D-Tic-Oic-Arg
TypeSmall organic molecule
Emp. Form.C63H95N19O13
Mol. Mass.1326.5479
SMILES[#6]-[#7](-[#6]-[#6](=O)-[#7](-[#6])-[#6@@H](-[#6]-c1ccccc1)-[#6](=O)-[#7]-[#6@@H](-[#6]-[#8])-[#6](=O)-[#7]-1-[#6]-c2ccccc2-[#6]-[#6@@H]-1-[#6](=O)-[#7]-1-[#6]-2-[#6]-[#6]-[#6]-[#6]-[#6]-2-[#6]-[#6@H]-1-[#6](=O)-[#7]-[#6@@H](-[#6]-[#6]-[#6]\[#7]=[#6](\[#7])-[#7])-[#6](-[#8])=O)-[#6](=O)-[#6@@H]-1-[#6]-[#6@H](-[#8])-[#6]-[#7]-1-[#6](=O)-[#6@@H]-1-[#6]-[#6]-[#6]-[#7]-1-[#6](=O)-[#6@H](-[#6]-[#6]-[#6]\[#7]=[#6](\[#7])-[#7])-[#7]-[#6](=O)-[#6@H](-[#7])-[#6]-[#6]-[#6]\[#7]=[#6](\[#7])-[#7]