Reaction Details
TargetD(2) dopamine receptor
LigandBDBM50029413
Substrate/Competitorn/a
Meas. Tech.ChEBML_58690
IC50 12±n/a nM
Citation Palm, JBøgesø, KPLiljefors, T A structure-activity study of four dopamine D-1 and D-2 receptor antagonists, representing the phenylindan, -indene, and -indole structural classes of compounds. J Med Chem36:2878-85 (1993) D(2) dopamine receptor
Name:D(2) dopamine receptor
Type:G Protein-Coupled Receptor (GPCR)
Mol. Mass.:50931.60
Organism:Rattus norvegicus (rat)
Description:P61169
Residue:444
BDBM50029413
NameBDBM50029413
Synonyms:1-[6-Chloro-3-(4-fluoro-phenyl)-indan-1-yl]-4-methyl-piperazine | CHEMBL318714
TypeSmall organic molecule
Emp. Form.C20H22ClFN2
Mol. Mass.344.853
SMILESCN1CCN(CC1)C1CC(c2ccc(Cl)cc12)c1ccc(F)cc1