Reaction Details
TargetPurine nucleoside phosphorylase
LigandBDBM50046234
Substrate/Competitorn/a
Meas. Tech.ChEMBL_153324 (CHEMBL882291)
Ki 100±n/a nM
Citation Montgomery, JANiwas, SRose, JDSecrist, JABabu, YSBugg, CEErion, MDGuida, WCEalick, SE Structure-based design of inhibitors of purine nucleoside phosphorylase. 1. 9-(arylmethyl) derivatives of 9-deazaguanine. J Med Chem36:55-69 (1993) Purine nucleoside phosphorylase
Name:Purine nucleoside phosphorylase
Type:Enzyme
Mol. Mass.:32035.18
Organism:Bos taurus (bovine)
Description:n/a
Residue:289
BDBM50046234
NameBDBM50046234
Synonyms:2-Amino-7-benzyl-3,4a,5,7a-tetrahydro-pyrrolo[3,2-d]pyrimidin-4-one | CHEMBL161609
TypeSmall organic molecule
Emp. Form.C13H14N4O
Mol. Mass.242.2765
SMILESNc1nc2C(Cc3ccccc3)CNc2c(=O)[nH]1