Reaction Details
TargetPurine nucleoside phosphorylase
LigandBDBM50046223
Substrate/Competitorn/a
Meas. Tech.ChEBML_153325
IC50 0.850000±n/a nM
Citation Montgomery, JANiwas, SRose, JDSecrist, JABabu, YSBugg, CEErion, MDGuida, WCEalick, SE Structure-based design of inhibitors of purine nucleoside phosphorylase. 1. 9-(arylmethyl) derivatives of 9-deazaguanine. J Med Chem36:55-69 (1993) Purine nucleoside phosphorylase
Name:Purine nucleoside phosphorylase
Type:Enzyme
Mol. Mass.:32119.53
Organism:Homo sapiens (Human)
Description:n/a
Residue:289
BDBM50046223
NameBDBM50046223
Synonyms:2-Amino-6-benzylamino-3,7-dihydro-pyrrolo[3,2-d]pyrimidin-4-one | CHEMBL345473
TypeSmall organic molecule
Emp. Form.C13H13N5O
Mol. Mass.255.2752
SMILESNc1nc2cc(NCc3ccccc3)[nH]c2c(=O)[nH]1