Reaction Details
TargetPurine nucleoside phosphorylase
LigandBDBM50046227
Substrate/Competitorn/a
Meas. Tech.ChEBML_153325
IC50 0.030000±n/a nM
Citation Montgomery, JANiwas, SRose, JDSecrist, JABabu, YSBugg, CEErion, MDGuida, WCEalick, SE Structure-based design of inhibitors of purine nucleoside phosphorylase. 1. 9-(arylmethyl) derivatives of 9-deazaguanine. J Med Chem36:55-69 (1993) Purine nucleoside phosphorylase
Name:Purine nucleoside phosphorylase
Type:Enzyme
Mol. Mass.:32119.53
Organism:Homo sapiens (Human)
Description:n/a
Residue:289
BDBM50046227
NameBDBM50046227
Synonyms:2-Amino-6-thiophen-2-ylmethyl-3,7-dihydro-pyrrolo[3,2-d]pyrimidin-4-one | CHEMBL349855
TypeSmall organic molecule
Emp. Form.C11H10N4OS
Mol. Mass.246.288
SMILESNc1nc2cc(Cc3cccs3)[nH]c2c(=O)[nH]1