Reaction Details
TargetPurine nucleoside phosphorylase
LigandBDBM50046250
Substrate/Competitorn/a
Meas. Tech.ChEBML_153325
IC50 48±n/a nM
Citation Montgomery, JANiwas, SRose, JDSecrist, JABabu, YSBugg, CEErion, MDGuida, WCEalick, SE Structure-based design of inhibitors of purine nucleoside phosphorylase. 1. 9-(arylmethyl) derivatives of 9-deazaguanine. J Med Chem36:55-69 (1993) Purine nucleoside phosphorylase
Name:Purine nucleoside phosphorylase
Type:Enzyme
Mol. Mass.:32119.53
Organism:Homo sapiens (Human)
Description:n/a
Residue:289
BDBM50046250
NameBDBM50046250
Synonyms:2-Amino-6-(3-methyl-thiophen-2-ylmethyl)-3,7-dihydro-pyrrolo[3,2-d]pyrimidin-4-one | CHEMBL159409
TypeSmall organic molecule
Emp. Form.C12H12N4OS
Mol. Mass.260.315
SMILESCc1ccsc1Cc1cc2nc(N)[nH]c(=O)c2[nH]1