Reaction Details
TargetAromatic-L-amino-acid decarboxylase
LigandBDBM50046351
Substrate/Competitorn/a
Meas. Tech.ChEMBL_36194 (CHEMBL649363)
Ki 24300±n/a nM
Citation Zembower, DEGilbert, JAAmes, MM Enantiospecific syntheses of alpha-(fluoromethyl)tryptophan analogues: interactions with tryptophan hydroxylase and aromatic L-amino acid decarboxylase. J Med Chem36:305-13 (1993) Aromatic-L-amino-acid decarboxylase
Name:Aromatic-L-amino-acid decarboxylase
Type:PROTEIN
Mol. Mass.:53874.00
Organism:Mus musculus
Description:ChEMBL_1333664
Residue:480
BDBM50046351
NameBDBM50046351
Synonyms:2-Amino-2-fluoromethyl-3-(5-hydroxy-1H-indol-3-yl)-propionic acid | CHEMBL108478
TypeSmall organic molecule
Emp. Form.C12H13FN2O3
Mol. Mass.252.2416
SMILESN[C@@](CF)(Cc1c[nH]c2ccc(O)cc12)C(O)=O