Reaction Details
Target5-hydroxytryptamine receptor 1A
LigandBDBM50046596
Substrate/Competitorn/a
Meas. Tech.ChEMBL_588 (CHEMBL615458)
Ki 1.5±n/a nM
Citation Lin, CHHaadsma-Svensson, SRLahti, RAMcCall, RBPiercey, MFSchreur, PJVonVoigtlander, PFChidester, CG Centrally acting serotonergic agents. Synthesis and structure-activity relationships of C-1- or C-3-substituted derivatives of 8-hydroxy-2-(di-n-propylamino)tetralin. J Med Chem36:671-82 (1993) 5-hydroxytryptamine receptor 1A
Name:5-hydroxytryptamine receptor 1A
Type:n/a
Mol. Mass.:46122.49
Organism:Homo sapiens (Human)
Description:n/a
Residue:422
BDBM50046596
NameBDBM50046596
Synonyms:Allyl-(1-allyl-8-methoxy-1,2,3,4-tetrahydro-naphthalen-2-yl)-amine | CHEMBL158749
TypeSmall organic molecule
Emp. Form.C17H23NO
Mol. Mass.257.3706
SMILESCOc1cccc2CC[C@@H](NCC=C)[C@@H](CC=C)c12