Reaction Details
Target5-hydroxytryptamine receptor 1A
LigandBDBM50046613
Substrate/Competitorn/a
Meas. Tech.ChEMBL_588 (CHEMBL615458)
Ki 0.5±n/a nM
Citation Lin, CHHaadsma-Svensson, SRLahti, RAMcCall, RBPiercey, MFSchreur, PJVonVoigtlander, PFChidester, CG Centrally acting serotonergic agents. Synthesis and structure-activity relationships of C-1- or C-3-substituted derivatives of 8-hydroxy-2-(di-n-propylamino)tetralin. J Med Chem36:671-82 (1993) 5-hydroxytryptamine receptor 1A
Name:5-hydroxytryptamine receptor 1A
Type:n/a
Mol. Mass.:46122.49
Organism:Homo sapiens (Human)
Description:n/a
Residue:422
BDBM50046613
NameBDBM50046613
Synonyms:8-Allyl-7-propylamino-5,6,7,8-tetrahydro-naphthalen-1-ol | CHEMBL347700
TypeSmall organic molecule
Emp. Form.C16H23NO
Mol. Mass.245.3599
SMILESCCCN[C@@H]1CCc2cccc(O)c2[C@@H]1CC=C