Reaction Details
TargetThromboxane A2 receptor
LigandBDBM50047054
Substrate/Competitorn/a
Meas. Tech.ChEMBL_207650 (CHEMBL811632)
Ki 6±n/a nM
Citation Nicolaï, EGoyard, JBenchetrit, TTeulon, JMCaussade, FVirone, ADelchambre, CCloarec, A Synthesis and structure-activity relationships of novel benzimidazole and imidazo[4,5-b]pyridine acid derivatives as thromboxane A2 receptor antagonists. J Med Chem36:1175-87 (1993) Thromboxane A2 receptor
Name:Thromboxane A2 receptor
Type:Enyzme
Mol. Mass.:37445.28
Organism:Homo sapiens (Human)
Description:P21731
Residue:343
BDBM50047054
NameBDBM50047054
Synonyms:4-[1-(3,4-Dichloro-benzyl)-5-fluoro-1H-benzoimidazol-2-yl]-3,3-dimethyl-butyric acid | CHEMBL18257
TypeSmall organic molecule
Emp. Form.C20H19Cl2FN2O2
Mol. Mass.409.281
SMILESCC(C)(CC(O)=O)Cc1nc2cc(F)ccc2n1Cc1ccc(Cl)c(Cl)c1