Reaction Details
TargetSodium-dependent serotonin transporter
LigandBDBM50047086
Substrate/Competitorn/a
Meas. Tech.ChEMBL_198045 (CHEMBL804187)
IC50 0.6±n/a nM
Citation Malleron, JLGuérémy, CMignani, SPeyronel, JFTruchon, ABlanchard, JCDoble, ALaduron, PPiot, OZundel, JL New indole derivatives as potent and selective serotonin uptake inhibitors. J Med Chem36:1194-202 (1993) Sodium-dependent serotonin transporter
Name:Sodium-dependent serotonin transporter
Type:Multi-pass membrane protein
Mol. Mass.:70168.43
Organism:Rattus norvegicus (rat)
Description:P31652
Residue:630
BDBM50047086
NameBDBM50047086
Synonyms:2-{3-[4-(1-Methyl-1H-indol-3-yl)-3,6-dihydro-2H-pyridin-1-yl]-propyl}-2H-naphtho[1,8-cd]isothiazole 1,1-dioxide | CHEMBL19111
TypeSmall organic molecule
Emp. Form.C27H27N3O2S
Mol. Mass.457.587
SMILESCn1cc(C2=CCN(CCCN3c4cccc5cccc(c45)S3(=O)=O)CC2)c2ccccc12