Reaction Details
TargetSodium-dependent serotonin transporter
LigandBDBM50047097
Substrate/Competitorn/a
Meas. Tech.ChEMBL_198045 (CHEMBL804187)
IC50 0.6±n/a nM
Citation Malleron, JLGuérémy, CMignani, SPeyronel, JFTruchon, ABlanchard, JCDoble, ALaduron, PPiot, OZundel, JL New indole derivatives as potent and selective serotonin uptake inhibitors. J Med Chem36:1194-202 (1993) Sodium-dependent serotonin transporter
Name:Sodium-dependent serotonin transporter
Type:Multi-pass membrane protein
Mol. Mass.:70168.43
Organism:Rattus norvegicus (rat)
Description:P31652
Residue:630
BDBM50047097
NameBDBM50047097
Synonyms:2-{2-[4-(1H-Indol-3-yl)-3,6-dihydro-2H-pyridin-1-yl]-ethyl}-2H-naphtho[1,8-cd]isothiazole 1,1-dioxide | CHEMBL274517
TypeSmall organic molecule
Emp. Form.C25H23N3O2S
Mol. Mass.429.534
SMILESO=S1(=O)N(CCN2CCC(=CC2)c2c[nH]c3ccccc23)c2cccc3cccc1c23