Reaction Details
TargetSodium-dependent serotonin transporter
LigandBDBM50047092
Substrate/Competitorn/a
Meas. Tech.ChEMBL_198045 (CHEMBL804187)
IC50 0.4±n/a nM
Citation Malleron, JLGuérémy, CMignani, SPeyronel, JFTruchon, ABlanchard, JCDoble, ALaduron, PPiot, OZundel, JL New indole derivatives as potent and selective serotonin uptake inhibitors. J Med Chem36:1194-202 (1993) Sodium-dependent serotonin transporter
Name:Sodium-dependent serotonin transporter
Type:Multi-pass membrane protein
Mol. Mass.:70168.43
Organism:Rattus norvegicus (rat)
Description:P31652
Residue:630
BDBM50047092
NameBDBM50047092
Synonyms:1-{2-[4-(5-Fluoro-1H-indol-3-ylmethyl)-piperidin-1-yl]-ethyl}-5,6-dihydro-1H,4H-imidazo[4,5,1-ij]quinolin-2-one | CHEMBL19347
TypeSmall organic molecule
Emp. Form.C26H29FN4O
Mol. Mass.432.5331
SMILESFc1ccc2[nH]cc(CC3CCN(CCn4c5cccc6CCCn(c56)c4=O)CC3)c2c1