Reaction Details
TargetSodium-dependent serotonin transporter
LigandBDBM50047088
Substrate/Competitorn/a
Meas. Tech.ChEMBL_198045 (CHEMBL804187)
IC50 5±n/a nM
Citation Malleron, JLGuérémy, CMignani, SPeyronel, JFTruchon, ABlanchard, JCDoble, ALaduron, PPiot, OZundel, JL New indole derivatives as potent and selective serotonin uptake inhibitors. J Med Chem36:1194-202 (1993) Sodium-dependent serotonin transporter
Name:Sodium-dependent serotonin transporter
Type:Multi-pass membrane protein
Mol. Mass.:70168.43
Organism:Rattus norvegicus (rat)
Description:P31652
Residue:630
BDBM50047088
NameBDBM50047088
Synonyms:2-{2-[4-(3H-Inden-1-ylmethyl)-piperidin-1-yl]-ethyl}-2H-naphtho[1,8-cd]isothiazole 1,1-dioxide | CHEMBL416544
TypeSmall organic molecule
Emp. Form.C27H28N2O2S
Mol. Mass.444.588
SMILESO=S1(=O)N(CCN2CCC(CC3=CCc4ccccc34)CC2)c2cccc3cccc1c23