Reaction Details
TargetAdenosine receptor A1
LigandBDBM50047182
Substrate/Competitorn/a
Meas. Tech.ChEBML_29455
Ki 5430±n/a nM
Citation Jacobson, KAGallo-Rodriguez, CMelman, NFischer, BMaillard, Mvan Bergen, Avan Galen, PJKarton, Y Structure-activity relationships of 8-styrylxanthines as A2-selective adenosine antagonists. J Med Chem36:1333-42 (1993) Adenosine receptor A1
Name:Adenosine receptor A1
Type:Protein
Mol. Mass.:36704.13
Organism:Rattus norvegicus (rat)
Description:n/a
Residue:326
BDBM50047182
NameBDBM50047182
Synonyms:8-[2-(3-Methoxy-phenyl)-vinyl]-1,3,7-trimethyl-3,7-dihydro-purine-2,6-dione | CHEMBL281657
TypeSmall organic molecule
Emp. Form.C17H18N4O3
Mol. Mass.326.3498
SMILESCOc1cccc(\C=C\c2nc3n(C)c(=O)n(C)c(=O)c3n2C)c1