Reaction Details
TargetAdenosine receptor A1
LigandBDBM50047204
Substrate/Competitorn/a
Meas. Tech.ChEBML_29455
Ki 143±n/a nM
Citation Jacobson, KAGallo-Rodriguez, CMelman, NFischer, BMaillard, Mvan Bergen, Avan Galen, PJKarton, Y Structure-activity relationships of 8-styrylxanthines as A2-selective adenosine antagonists. J Med Chem36:1333-42 (1993) Adenosine receptor A1
Name:Adenosine receptor A1
Type:Protein
Mol. Mass.:36704.13
Organism:Rattus norvegicus (rat)
Description:n/a
Residue:326
BDBM50047204
NameBDBM50047204
Synonyms:1,3-Dipropyl-8-[2-(2,4,5-trimethoxy-phenyl)-vinyl]-3,7-dihydro-purine-2,6-dione | CHEMBL26837
TypeSmall organic molecule
Emp. Form.C22H28N4O5
Mol. Mass.428.4815
SMILESCCCn1c2nc(C=Cc3cc(OC)c(OC)cc3OC)[nH]c2c(=O)n(CCC)c1=O