Reaction Details
TargetAdenosine receptor A1
LigandBDBM50037426
Substrate/Competitorn/a
Meas. Tech.ChEBML_29455
Ki 35100.0±n/a nM
Citation Jacobson, KAGallo-Rodriguez, CMelman, NFischer, BMaillard, Mvan Bergen, Avan Galen, PJKarton, Y Structure-activity relationships of 8-styrylxanthines as A2-selective adenosine antagonists. J Med Chem36:1333-42 (1993) Adenosine receptor A1
Name:Adenosine receptor A1
Type:Protein
Mol. Mass.:36704.13
Organism:Rattus norvegicus (rat)
Description:n/a
Residue:326
BDBM50037426
NameBDBM50037426
Synonyms:CHEMBL25976 N-{3-[2-(1,3,7-Trimethyl-2,6-dioxo-2,3,6,7-tetrahydro-1H-purin-8-yl)-vinyl]-phenyl}-succinamic acid
TypeSmall organic molecule
Emp. Form.C20H21N5O5
Mol. Mass.411.4112
SMILESCn1c(\C=C\c2cccc(NC(=O)CCC(O)=O)c2)nc2n(C)c(=O)n(C)c(=O)c12