Reaction Details
TargetAdenosine receptor A2a/A2b
LigandBDBM50037426
Substrate/Competitorn/a
Meas. Tech.ChEMBL_30723 (CHEMBL648802)
Ki 143±n/a nM
Citation Jacobson, KAGallo-Rodriguez, CMelman, NFischer, BMaillard, Mvan Bergen, Avan Galen, PJKarton, Y Structure-activity relationships of 8-styrylxanthines as A2-selective adenosine antagonists. J Med Chem36:1333-42 (1993) Adenosine receptor A2a/A2b
Name:Adenosine receptor A2a/A2b
Synonyms:Adenosine A2 receptor
Type:n/a
Mol. Mass.:n/a
Description:ASSAY_ID of ChEMBL is 30560
Components:This complex has 2 components.
Component 1
Name:Adenosine receptor A2b
Type:PROTEIN
Mol. Mass.:36378.84
Organism:Rattus norvegicus
Description:ChEMBL_32934
Residue:332
Component 2
Name:Adenosine receptor A2a
Synonyms:AA2AR_RAT Adenosine A2 receptor Adenosine Receptors A2a (A2a) Adenosine receptors A2a Rat striatal adenosine A2a receptor
Type:G Protein-Coupled Receptor (GPCR)
Mol. Mass.:45015.65
Organism:Rattus norvegicus (rat)
Description:Rat A2A receptors expressed in CHO cells.
Residue:410
BDBM50037426
NameBDBM50037426
Synonyms:CHEMBL25976 N-{3-[2-(1,3,7-Trimethyl-2,6-dioxo-2,3,6,7-tetrahydro-1H-purin-8-yl)-vinyl]-phenyl}-succinamic acid
TypeSmall organic molecule
Emp. Form.C20H21N5O5
Mol. Mass.411.4112
SMILESCn1c(\C=C\c2cccc(NC(=O)CCC(O)=O)c2)nc2n(C)c(=O)n(C)c(=O)c12