Reaction Details
TargetProstaglandin G/H synthase 1
LigandBDBM50048219
Substrate/Competitorn/a
Meas. Tech.ChEMBL_158585 (CHEMBL767753)
IC50>10000±n/a nM
Citation Li, CSBlack, WCChan, CCFord-Hutchinson, AWGauthier, JYGordon, RGuay, DKargman, SLau, CKMancini, J Cyclooxygenase-2 inhibitors. Synthesis and pharmacological activities of 5-methanesulfonamido-1-indanone derivatives. J Med Chem38:4897-905 (1996) Prostaglandin G/H synthase 1
Name:Prostaglandin G/H synthase 1
Type:Enzyme
Mol. Mass.:68692.62
Organism:Homo sapiens (Human)
Description:P23219
Residue:599
BDBM50048219
NameBDBM50048219
Synonyms:CHEMBL144441 | N-(6-Cyclopentyloxy-1-oxo-indan-5-yl)-methanesulfonamide
TypeSmall organic molecule
Emp. Form.C15H19NO4S
Mol. Mass.309.381
SMILESCS(=O)(=O)Nc1cc2CCC(=O)c2cc1OC1CCCC1