Reaction Details
TargetProstaglandin G/H synthase 2
LigandBDBM50048222
Substrate/Competitorn/a
Meas. Tech.ChEMBL_159598 (CHEMBL760080)
IC50>10000±n/a nM
Citation Li, CSBlack, WCChan, CCFord-Hutchinson, AWGauthier, JYGordon, RGuay, DKargman, SLau, CKMancini, J Cyclooxygenase-2 inhibitors. Synthesis and pharmacological activities of 5-methanesulfonamido-1-indanone derivatives. J Med Chem38:4897-905 (1996) Prostaglandin G/H synthase 2
Name:Prostaglandin G/H synthase 2
Type:Enzyme
Mol. Mass.:69003.89
Organism:Homo sapiens (Human)
Description:Recombinant Cox-2 provided by Cayman (Cayman Chemical Co.,Ann Arbor, MI).
Residue:604
BDBM50048222
NameBDBM50048222
Synonyms:CHEMBL145257 | N-[6-(2,4-Difluoro-benzenesulfonyl)-1-oxo-indan-5-yl]-methanesulfonamide
TypeSmall organic molecule
Emp. Form.C16H13F2NO5S2
Mol. Mass.401.405
SMILESCS(=O)(=O)Nc1cc2CCC(=O)c2cc1S(=O)(=O)c1ccc(F)cc1F