Reaction Details
TargetRetinoic acid receptor gamma
LigandBDBM50048282
Substrate/Competitorn/a
Meas. Tech.ChEMBL_196012 (CHEMBL798022)
Ki 153±n/a nM
Citation Charpentier, BBernardon, JMEustache, JMillois, CMartin, BMichel, SShroot, B Synthesis, structure-affinity relationships, and biological activities of ligands binding to retinoic acid receptor subtypes. J Med Chem38:4993-5006 (1996) Retinoic acid receptor gamma
Name:Retinoic acid receptor gamma
Type:PROTEIN
Mol. Mass.:50345.43
Organism:Homo sapiens (Human)
Description:ChEMBL_1458016
Residue:454
BDBM50048282
NameBDBM50048282
Synonyms:6-[3-Adamantan-1-yl-4-(1,2-dihydroxy-ethyl)-phenyl]-naphthalene-2-carboxylic acid | CHEMBL357603
TypeSmall organic molecule
Emp. Form.C29H30O4
Mol. Mass.442.5461
SMILESOCC(O)c1ccc(cc1C12CC3CC(CC(C3)C1)C2)-c1ccc2cc(ccc2c1)C(O)=O