Reaction Details
TargetAdenosine receptor A2a
LigandBDBM50048458
Substrate/Competitorn/a
Meas. Tech.ChEMBL_31060 (CHEMBL641344)
Ki 60±n/a nM
Citation van Rhee, AMSiddiqi, SMMelman, NShi, DPadgett, WLDaly, JWJacobson, KA Tetrahydrobenzothiophenone derivatives as a novel class of adenosine receptor antagonists. J Med Chem39:398-406 (1996) 
 
Adenosine receptor A2a
Name:Adenosine receptor A2a
Type:G Protein-Coupled Receptor (GPCR)
Mol. Mass.:45015.65
Organism:Rattus norvegicus (rat)
Description:Rat A2A receptors expressed in CHO cells.
Residue:410
BDBM50048458
NameBDBM50048458
Synonyms:CHEMBL130162 | N-(2-Amino-ethyl)-2-[4-(6-oxo-1,3-dipropyl-2,3,6,7-tetrahydro-1H-purin-8-yl)-phenoxy]-acetamide
TypeSmall organic molecule
Emp. Form.C21H30N6O3
Mol. Mass.414.5013
SMILESCCCN1CN(CCC)C(=O)c2[nH]c(nc12)-c1ccc(OCC(=O)NCCN)cc1